{"text_format":"1","workbook":"xlsx","n_sheets":21,"sheets":["Intro & Checklist","1-Production Info","2-Electricity","3-Nat Gas & Heating Oil","4-Fuel","5-Hotels-Housing","6-Commercial Air Travel","7-Charter and Heli Flights","8-Practices & Procurement","Results","Sheet1","Lookups","ElectricityEFs","FuelEFs","CBECs","Cost","MPG","AirTravel","HotelFactors","Plywood tracking","Equivalents"],"not_rendered":{"charts":3,"images":9,"macros":1,"external_links":0,"defined_names":71,"comments":3,"pivot_tables":0},"unopened":[],"bounds":{"document_bytes":16777216,"sheet_cells":100000,"rows_first":2000,"rows_last":500,"rows_between":2000,"halvings":0,"cell_chars":16384,"cell_head_chars":4096},"cells_cut":0,"cells_raw":0,"read":"whole","date_system":"1900"}

{"sheet":"Intro & Checklist","index":0,"n_rows":16,"n_cols":5,"rows_kept":16,"cut":false,"hidden":false,"merged":[[2,1,2,3],[3,1,3,3],[1,1,1,3]]}
[null,null,null,"Version 3.0"]
[null,"Production Carbon Calculator General Info & Checklist"]
[null,"This calculator measures the carbon emissions generated by your production based on information you enter on emission sources such as utility electricity and heating, fuel, flight and hotel use.  Information for each emission source is collected on a separate worksheet tab.  Information is not required for every tab, and should only be entered for the emission sources associated with your production. \nThe table below provides a general description of the information collected and data collection status for each emission source data collection worksheet."]
[]
[null,"Click on a tab name to link to the sheet"]
[null,"Status","Calculator Tab","Description","Potential Sources of Data"]
{"$rows_left_out":11}
{"sheet":"1-Production Info","index":1,"n_rows":41,"n_cols":15,"rows_kept":41,"cut":false,"hidden":false,"merged":[[2,13,3,20],[8,14,8,20],[19,15,21,20],[22,15,24,20],[4,14,5,20],[6,14,7,20],[9,14,15,20],[7,1,7,6],[14,1,14,6],[3,5,3,6],[3,1,3,3],[11,8,11,10],[12,8,12,10],[14,8,14,10],[13,1,13,6],[11,5,12,6]]}
[]
[null,"Click for Checklist",null,"Required field",null,"Input not required"]
[null,null,null,null,null,null,null,null,null,null,null,null,null,"Instructions"]
[null,"Production Calculator Contact",null,null,null,"Production Coordinator Sign Off"]
[null,"Name","Phone Number","Date",null,"Name","Date",null,null,null,null,null,null,null,"1. Production Calculator Contact Information: Enter your name, information and the date"]
[]
{"$rows_left_out":36}
{"sheet":"2-Electricity","index":2,"n_rows":45,"n_cols":25,"rows_kept":45,"cut":false,"hidden":false,"merged":[[11,8,11,9],[3,22,4,29],[8,23,8,29],[11,19,11,21],[1,18,1,20],[9,23,10,29],[13,24,14,29],[15,23,16,23],[5,23,7,29],[11,23,12,29],[15,24,17,29],[18,24,20,29],[22,22,25,30],[10,4,10,9],[3,1,3,9],[11,12,11,17],[5,1,6,1],[10,12,10,17],[5,2,6,2],[10,1,10,3],[5,4,5,9],[6,4,8,9],[11,3,12,3],[11,2,12,2],[11,10,12,10],[11,1,12,1],[11,5,11,7]]}
[]
[null,"Click for Checklist",null,null,null,null,null,"Required field",null,"Input not required"]
[]
[null,{"$f":"'1-Production Info'!C9& \" Purchased Electricity\"","v":" Purchased Electricity"},null,null,null,null,null,null,null,null,null,null,null,null,null,null,null,null,null,null,null,null,"Instructions"]
[]
[null,"Did You Purchase Renewable Energy or RECs?",null,null,"Comments",null,null,null,null,null,null,null,null,null,null,null,null,null,null,null,null,null,null,"1. General Electricity Questions:  Select Yes or No from the dropdowns to identify if you purchased renewable energy, RECs or used power drops on your production.  \nEnter comments about your production energy use (optional)"]
{"$rows_left_out":40}
{"sheet":"3-Nat Gas & Heating Oil","index":3,"n_rows":44,"n_cols":27,"rows_kept":44,"cut":false,"hidden":false,"merged":[[19,26,21,31],[22,26,24,31],[1,1,1,2],[3,1,3,11],[6,1,6,11],[8,1,8,4],[9,7,9,9],[8,5,8,11],[9,3,10,3],[9,1,10,1],[9,12,10,12],[9,10,9,11],[9,4,10,4],[9,2,10,2],[9,5,9,6],[1,19,1,21],[7,15,7,16],[9,14,9,20],[3,24,4,31],[7,24,9,24],[9,22,9,23],[7,25,9,31],[15,26,18,31],[16,24,17,25],[13,25,14,31],[5,25,6,31],[11,25,12,31],[10,25,10,31]]}
[]
[null,"Click for Checklist",null,null,null,null,null,null,null,"Required field",null,"Input not required"]
[]
[null,{"$f":"'1-Production Info'!C9& \" Natural Gas & Fuel Oil\"","v":" Natural Gas & Fuel Oil"},null,null,null,null,null,null,null,null,null,null,null,null,null,null,null,null,null,null,null,null,null,null,"Instructions"]
[]
[null,"Comments",null,null,null,null,null,null,null,null,null,null,null,null,null,null,null,null,null,null,null,null,null,null,null,"1. General Natural Gas & Heating Oil Questions:  Enter comments about natural gas and heating oil use for your production (optional)"]
{"$rows_left_out":39}
{"sheet":"4-Fuel","index":4,"n_rows":38,"n_cols":26,"rows_kept":38,"cut":false,"hidden":false,"merged":[[23,24,24,24],[26,24,27,24],[26,25,27,29],[28,24,29,29],[5,23,6,29],[12,23,12,29],[18,24,22,29],[23,25,24,29],[10,22,11,22],[11,23,11,29],[14,24,17,29],[1,1,1,2],[3,22,4,29],[6,22,8,22],[7,23,7,29],[8,23,10,29],[1,19,1,21],[5,1,6,1],[3,1,3,10],[9,6,9,10],[10,20,10,21],[8,14,8,15],[10,4,11,4],[10,6,10,7],[10,5,11,5],[5,2,6,2],[10,13,10,18],[10,1,11,1],[10,11,11,11],[10,3,11,3],[9,1,9,5],[10,2,11,2],[10,8,10,9],[6,4,7,10],[5,4,5,10]]}
[]
[null,"Click for Checklist",null,null,null,null,null,null,"Required field",null,"Input not required"]
[]
[null,{"$f":"'1-Production Info'!C9& \" Fuel\"","v":" Fuel"},null,null,null,null,null,null,null,null,null,null,null,null,null,null,null,null,null,null,null,null,"Instructions"]
[]
[null,"How many hybrid vehicles did you use?",null,null,"Comments",null,null,null,null,null,null,null,null,null,null,null,null,null,null,null,null,null,null,"1. General Fuel Questions:  Select Yes or No from the dropdowns to identify if you used hybrid vehicles or enforced the no-idling policy on your set.  Enter comments about your production fuel use (optional)"]
{"$rows_left_out":33}
{"sheet":"5-Hotels-Housing","index":5,"n_rows":35,"n_cols":22,"rows_kept":35,"cut":false,"hidden":false,"merged":[[3,19,4,26],[6,19,8,19],[11,19,12,19],[10,20,10,26],[11,20,14,26],[3,1,3,7],[9,1,9,4],[8,10,8,15],[8,17,8,18],[5,11,5,12],[5,1,6,1],[5,2,6,2],[18,20,18,26],[22,21,23,26],[19,21,20,26],[9,5,9,6],[6,4,7,7],[5,20,8,26],[15,20,16,26],[5,4,5,7]]}
[]
[null,"Click for Checklist",null,null,"Required field",null,"Input not required"]
[]
[null,{"$f":"'1-Production Info'!C9& \" Hotels & Housing\"","v":" Hotels & Housing"},null,null,null,null,null,null,null,null,null,null,null,null,null,null,null,null,null,"Instructions"]
[]
[null,"Did you choose a hotel because it is considered \"green\"?",null,null,"Comments",null,null,null,null,null,"Status:",{"$f":"IF(ISERROR(S12),\"Data Input Error\",IF(S12>0,\"Data Entered Correctly\",\"Data Not Entered\"))","v":"Data Not Entered"},null,null,null,null,null,null,null,null,"1. General Hotel & Housing Questions:  Select Yes or No from the dropdown to identify if you choose a hotel because it is considered “green.” \nEnter comments about your production hotel & housing use (optional)"]
{"$rows_left_out":30}
{"sheet":"6-Commercial Air Travel","index":6,"n_rows":75,"n_cols":22,"rows_kept":75,"cut":false,"hidden":false,"merged":[[1,1,1,2],[9,1,9,5],[9,8,9,9],[21,21,27,26],[8,21,8,26],[9,21,16,26],[17,21,19,26],[6,19,7,19],[9,19,10,19],[3,19,4,26],[5,20,6,26],[9,10,10,10],[9,6,9,7],[3,1,3,7],[5,1,5,7],[6,1,6,7],[8,1,8,7],[7,20,7,26],[9,12,9,15],[7,1,7,3],[9,17,9,18],[7,13,7,14]]}
[]
[null,"Click for Checklist",null,null,null,"Required field",null,"Input not required"]
[]
[null,{"$f":"'1-Production Info'!C9& \" Commercial Air Travel\"","v":" Commercial Air Travel"},null,null,null,null,null,null,null,null,null,null,null,null,null,null,null,null,null,"Instructions"]
[]
[null,"Comments",null,null,null,null,null,null,null,null,null,null,null,null,null,null,null,null,null,null,"1. General Commercial Air Travel Information:  Enter comments about commercial air travel for your production (optional) "]
{"$rows_left_out":70}
{"sheet":"7-Charter and Heli Flights","index":7,"n_rows":34,"n_cols":22,"rows_kept":34,"cut":false,"hidden":false,"merged":[[3,19,4,26],[5,20,6,26],[6,19,8,19],[10,19,11,19],[7,20,8,26],[9,20,9,26],[10,21,10,26],[11,21,12,26],[13,21,16,26],[9,10,9,15],[9,17,9,18],[5,11,5,12],[9,8,10,8],[1,1,1,2],[3,1,3,7],[9,2,10,2],[9,1,10,1],[8,3,8,7],[9,6,9,7],[9,3,9,4],[8,1,8,2],[5,1,5,7],[6,1,6,7]]}
[]
[null,"Click for Checklist",null,null,null,"Required field",null,"Input not required"]
[]
[null,{"$f":"'1-Production Info'!C9& \" Charter & Helicopter Flights\"","v":" Charter & Helicopter Flights"},null,null,null,null,null,null,null,null,null,null,null,null,null,null,null,null,null,"Instructions"]
[]
[null,"Comments",null,null,null,null,null,null,null,null,"Status:",{"$f":"IF(ISERROR(S12),\"Data Input Error\",IF(S12<>SUM(S13:S15),\"Multiple Options Entered\",IF(S12>0,\"Data Entered Correctly\",\"Data Not Entered\")))","v":"Data Not Entered"},null,null,null,null,null,null,null,null,"1. General Charter and Helicopter Flight Information:  Enter comments about charter and helicopter air travel for your production (optional) "]
{"$rows_left_out":29}
{"sheet":"8-Practices & Procurement","index":8,"n_rows":19,"n_cols":11,"rows_kept":19,"cut":false,"hidden":false,"merged":[[1,1,1,2],[6,5,9,6],[11,5,11,6],[5,5,5,6],[3,1,3,6],[16,1,16,6],[5,1,5,3],[11,1,12,1],[11,2,12,2],[11,3,12,3],[12,5,14,6],[18,10,18,15],[10,8,11,8],[5,9,10,15],[14,10,15,15],[1,15,1,16],[3,8,4,15],[6,8,8,8],[11,9,12,15],[16,10,17,15]]}
[]
[null,"Click for Checklist"]
[]
[null,{"$f":"'1-Production Info'!C9& \" Practices & Procurement\"","v":" Practices & Procurement"},null,null,null,null,null,null,"Instructions"]
[]
[null,"Waste Practices",null,null,null,"What other \"green\" practices did you implement?",null,null,null,"1. Waste Practice Information: Enter waste amount or cost information (such as 3 and 40 yards bins used or purchased), total amount of trash generated, recycled, and sent to landfills in column C.  \nSelect the appropriate units from column C for total trash, waste recycled, and trash sent to landfills from the dropdown list in column D"]
{"$rows_left_out":14}
{"sheet":"Results","index":9,"n_rows":45,"n_cols":6,"rows_kept":45,"cut":false,"hidden":false,"merged":[[1,2,1,6],[12,2,12,3],[21,2,22,2],[24,2,25,2]]}
[]
[null,null,{"$f":"\"Carbon Footprint of \"&'1-Production Info'!C9","v":"Carbon Footprint of "}]
[]
[null,null,null,"Emission Source","Metric Tons CO2","Percent Contribution"]
[null,null,null,"Electricity",{"$f":"IF(ISERROR('2-Electricity'!U14/1000), \"Data Error\", ('2-Electricity'!U14/1000))","v":0},{"$f":"IF(AND(ISNUMBER($E$10), $E$10>0), E5/$E$10, \"\")","v":""}]
[null,null,null,"Natural Gas & Heating Oil",{"$f":"IF(ISERROR('3-Nat Gas & Heating Oil'!X12/1000), \"Data Error\", '3-Nat Gas & Heating Oil'!X12/1000)","v":0},{"$f":"IF(AND(ISNUMBER($E$10), $E$10>0), E6/$E$10, \"\")","v":""}]
{"$rows_left_out":40}
{"sheet":"Sheet1","index":10,"n_rows":0,"n_cols":0,"rows_kept":0,"cut":false,"hidden":true,"merged":[]}

{"sheet":"Lookups","index":11,"n_rows":147,"n_cols":37,"rows_kept":147,"cut":false,"hidden":true,"merged":[]}
["Area_Units","AreaConvert","HeatFuel","NG_Units","NGConvert","FO_Units","FOConvert","Equipment","EquipmentType","Reason","Fuel_Units","FuelUnitsConvert","VehicleFuels","EquipmentFuels","Countries","States","CANProvinces","AusState","FuelOpt3Units","DistanceUnits","DistanceConvert","FlightDistanceUnits","FlightDistanceConversion","FlightClass","PlaneTypes","RoomTypes","WasteUnits","Procurement","WoodTypes","PaperTypes","Water Types","PaintTypes","PaperUnits","VolUnits","EventTypes","CBECType",{"$f":"IF(ISBLANK('1-Production Info'!B17), 1, '1-Production Info'!B17)","v":1}]
["square feet",1,"Fuel Oil","cubic feet",1,"gallons",1,"Cars","Vehicle","Personal","gallons",1,"Gasoline ","Gasoline ","USA","AK","Alberta","New South Wales","miles","miles",1,"land miles",1,"First","Chartered Commercial Jet","Economy Hotel","pounds","Wood","FSC Certified","Recycled white","Bottled water","Low VOC","Reams","Gallons","On Location","Office .......................",{"$f":"IF(ISBLANK('1-Production Info'!B18), 1, '1-Production Info'!B18)","v":1}]
["square meters",10.7639104,"Natural Gas","cubic meters",0.28316999999999998,"liters",0.26417205199999999,"Motorcycles","Vehicle","Production","liters",0.26417205199999999,"Diesel Fuel ","Diesel Fuel ","Canada","AL","British Columbia","Australian Capital Teritory","hours","kilometers",0.62137119200000002,"kilometers",0.62137119200000002,"Business","Large Private Jet","Midscale Hotel","kilograms","Paper","SFI Certified","Recycled color","5 gallon bottles","No VOC","Cases","Liters","Office","Office .......................",{"$f":"IF(ISBLANK('1-Production Info'!B19), 1, '1-Production Info'!B19)","v":1}]
["square yards",9,null,"Btu",1028,"Btu",138698,"Buses","Vehicle","Rental","std cubic feet",{"$f":"1/134.71","v":7.4233538712790434E-3},"Biodiesel (B100)","Kerosene ","United Kingdom","AR","Manitoba","Victoria",null,null,null,"nautical miles",1.1516,"Economy Plus","Small Private Jet","Upscale Hotel","metric tons","Paint","Reclaimed","Virgin white",null,null,null,null,"Warehouse","Warehouse and Storage ........",{"$f":"IF(ISBLANK('1-Production Info'!B20), 1, '1-Production Info'!B20)","v":1}]
["acres",43560,null,"Megajoules",1.0846,"Megajoules",146.33000000000001,"Vans, Pickups, SUVs","Vehicle","Other",null,null,"B5","RFO (Ships)","Australia","AZ","Labrador","Queensland",null,null,null,null,null,"Economy","Helicopter","Luxury Hotel","tons","Ahesives","Reused","Virgin color",null,null,null,null,"Stage(s)","Warehouse and Storage ........",{"$f":"IF(ISBLANK('1-Production Info'!B21), 1, '1-Production Info'!B21)","v":1}]
[null,null,null,null,null,null,null,"Trucks (<18 wheel)","Vehicle",null,"Fuel_UnitsPropane",null,"B20","Propane","Albania","CA","New Brunswick","South Australia",null,null,null,null,null,"Unknown",null,"Apartment/Condo",null,"Glass","Recycled",null,null,null,null,null,null,null,{"$f":"IF(ISBLANK('1-Production Info'!B22), 1, '1-Production Info'!B22)","v":1}]
{"$rows_left_out":142}
{"sheet":"ElectricityEFs","index":12,"n_rows":218,"n_cols":14,"rows_kept":218,"cut":false,"hidden":true,"merged":[]}
["ElectricityCode","Country","State/Province","lb/MWh","kg CO2 per kWh","Reference",null,null,null,null,null,null,null,"http://www.eia.doe.gov/cneaf/electricity/epa/epat7p4.html#_ftn1"]
["Albania","Albania",null,null,1.11746E-2,"Greenhouse Gas Protocol Initiative, Emission Factors from Cross-sector Tools, Versions 1.3, August 2012.  “Electricity Other Countries” worksheet"]
["Algeria","Algeria",null,null,0.57596690000000006,"Greenhouse Gas Protocol Initiative, Emission Factors from Cross-sector Tools, Versions 1.3, August 2012.  “Electricity Other Countries” worksheet"]
["Angola","Angola",null,null,0.23744970000000001,"Greenhouse Gas Protocol Initiative, Emission Factors from Cross-sector Tools, Versions 1.3, August 2012.  “Electricity Other Countries” worksheet"]
["Argentina","Argentina",null,null,0.35531109999999999,"Greenhouse Gas Protocol Initiative, Emission Factors from Cross-sector Tools, Versions 1.3, August 2012.  “Electricity Other Countries” worksheet"]
["Armenia","Armenia",null,null,0.108001,"Greenhouse Gas Protocol Initiative, Emission Factors from Cross-sector Tools, Versions 1.3, August 2012.  “Electricity Other Countries” worksheet"]
{"$rows_left_out":213}
{"sheet":"FuelEFs","index":13,"n_rows":24,"n_cols":5,"rows_kept":24,"cut":false,"hidden":true,"merged":[[23,2,23,3]]}
["Fuel","EF","Units","TCR Fuel Name","Reference"]
["Natural gas",5.3019999999999998E-2,"kg CO2/cubic foot","Natural gas","The Climate Registry's 2013 Default Emission Factors, Table 12.1 U.S. Default Factors for Calculating CO2 Emissions from Fossil Fuel and Biomass Combustion "]
["Fuel Oil",10.206479999999999,"kg CO2/gallon","Distilate Fuel Oil No. 2","The Climate Registry's 2013 Default Emission Factors, Table 12.1 U.S. Default Factors for Calculating CO2 Emissions from Fossil Fuel and Biomass Combustion (Residual Fuel Oil No.2) "]
["Kerosene ",10.152000000000001,"kg CO2/gallon","Kerosene ","The Climate Registry's 2013 Default Emission Factors, Table 12.1 U.S. Default Factors for Calculating CO2 Emissions from Fossil Fuel and Biomass Combustion "]
["Propane",5.5928599999999999,"kg CO2/gallon","Propane","The Climate Registry's 2013 Default Emission Factors, Table 13.1 U.S. Default Factors for Transport Fuels "]
["Gasoline ",8.7799999999999994,"kg CO2/gallon","Gasoline ","The Climate Registry's 2013 Default Emission Factors, Table 13.1 U.S. Default Factors for Transport Fuels "]
{"$rows_left_out":19}
{"sheet":"CBECs","index":14,"n_rows":18,"n_cols":6,"rows_kept":18,"cut":false,"hidden":true,"merged":[]}
[null,"Electricity","Natural Gas","Fuel Oil"]
["Principal Building Activity","per Square Foot (kWh)","per Square Foot \n(cubic feet)","per \nSquare Foot\n(gallons)"]
["Education ....................",11,36.9,0.18,null,"http://www.eia.doe.gov/emeu/cbecs/cbecs2003/detailed_tables_2003/detailed_tables_2003.html#enduse03"]
["Food Sales ...................",49.4,50.2,"Q"]
["Food Service .................",38.4,141.19999999999999,"Q"]
["Health Care ..................",22.9,92.5,0.04]
{"$rows_left_out":13}
{"sheet":"Cost","index":15,"n_rows":19,"n_cols":6,"rows_kept":19,"cut":false,"hidden":true,"merged":[]}
["Source","$ per standard unit","Standard Unit","Year","Reference"]
["Electricity",0.1188,"kWh",2012,"http://www.eia.doe.gov/emeu/steo/pub/"]
["Natural Gas",1.0659999999999999E-2,"cubic foot",2012,"http://www.eia.doe.gov/emeu/steo/pub/"]
["Fuel Oil",3.76,"gallon",2012,"Heating Oil from http://www.eia.doe.gov/emeu/steo/pub/"]
["Gasoline",3.63,"gallon",2012,"http://www.eia.doe.gov/emeu/steo/pub/"]
["Diesel",2.46,"gallon",2012,"http://www.eia.doe.gov/emeu/steo/pub/"]
{"$rows_left_out":14}
{"sheet":"MPG","index":16,"n_rows":13,"n_cols":4,"rows_kept":13,"cut":false,"hidden":true,"merged":[]}
["VehicleType","Fuel Efficiency (mpg)","US DOT classification","Reference Classification"]
["Cars",23.6,"Passenger Cars","Cars- Ref 1, Page 2"]
["Motorcycles",56.2,"Motorcycles","Motorcycles- Ref 2"]
["Buses",6,"Buses","Buses- Ref 3, Page 5"]
["Vans, Pickups, SUVs",17.5,"Other 2-Axel 4 Tire vehicles","Light Truck 2-Axel 4 Tire- Ref 1, Page 2"]
["Trucks (<18 wheel)",7.3,"Single-Unit 2-axles 6-tire or more trucks","Class 3-8 single-unit trucks, 2011- Ref 1, Page 131"]
{"$rows_left_out":8}
{"sheet":"AirTravel","index":17,"n_rows":20,"n_cols":16,"rows_kept":20,"cut":false,"hidden":true,"merged":[[20,12,21,12],[10,0,10,6]]}
["Length Classification","EF (kg CO2/passenger mile)","Max Distance (miles)","Total kg CO2 pkm*","DEFRA Classification",null,"Plane Type","Fuel Type","Gallons per Hour","miles per gallon",null,null,"Plane Type","Model","Gallons per Hour","Reference"]
["Short",{"$f":"D2*$D$7","v":0.28966856244480005},{"$f":"463/D7","v":287.69486200588562},{"$f":"109%*0.16513","v":0.1799917},"Domestic Average",null,"Chartered Commercial Jet","jet fuel",{"$f":"ROUND(SUMIF(M:M, G2,O:O )/COUNTIF(M:M, G2), -1)","v":950},{"$f":"ROUND(1/2.65,1)","v":0.4},"Climate Leaders Table 4: Fuel Economy Values by Vehicle Type",null,"Chartered Commercial Jet","737-800",850,"http://www.seattlepi.com/business/368286_air25.html"]
["Medium",{"$f":"D3*$D$7","v":0.16540209987840002},{"$f":"1108/D7","v":688.47928099896603},{"$f":"1.09*0.09429","v":0.10277610000000001},"Short-Haul International Average",null,"Large Private Jet","jet fuel",{"$f":"ROUND(SUMIF(M:M, G3,O:O )/COUNTIF(M:M, G3), -1)","v":440},{"$f":"ROUND(1.3, 1)","v":1.3},"http://www.ehow.com/about_5665316_private-suv-jet-fuel-cost.html",null,"Chartered Commercial Jet","MD-80",1050,"http://www.seattlepi.com/business/368286_air25.html"]
["Long",{"$f":"D4*$D$7","v":0.18925901533440004},null,{"$f":"1.09*0.10789","v":0.11760010000000001},"Long-Haul International Average",null,"Small Private Jet","jet fuel",{"$f":"ROUND(SUMIF(M:M, G4,O:O )/COUNTIF(M:M, G4), -1)","v":220},4,"http://www.ehow.com/about_5665316_private-suv-jet-fuel-cost.html",10,"Small Private Jet","Citation Excel",250,"Joe Bellas, Universal carbon calculator factors based on equipment manual"]
["Average",{"$f":"AVERAGE(B2:B4)","v":0.21477655921920003},null,null,null,null,"Helicopter","aviation gasoline",{"$f":"ROUND(SUMIF(M:M, G5,O:O )/COUNTIF(M:M, G5), -1)","v":50},{"$f":"ROUND(1.65, 1)","v":1.7},"http://en.wikipedia.org/wiki/Fuel_efficiency_in_transportation",10,"Small Private Jet","Cessna 50XL Citation",166,"Joe Bellas, Universal carbon calculator factors based on equipment manual"]
[null,null,null,null,null,null,null,null,null,null,null,null,"Small Private Jet","ACG 39 / Lear 45",184,"Joe Bellas, Universal carbon calculator factors based on equipment manual"]
{"$rows_left_out":15}
{"sheet":"HotelFactors","index":18,"n_rows":20,"n_cols":8,"rows_kept":20,"cut":false,"hidden":true,"merged":[]}
["Room Type","Square Footage","kWh/square foot/yr","kWh/yr","KBtu/sq foot/yr","natural gas/yr","Year"]
["Economy Hotel",535,10.31,{"$f":"B2*C2","v":5515.85},42.45,{"$f":"E2*Lookups!$E$4/100*B2","v":233466.51000000004},2005,"hotel_casino_analysis.pdf, Table 16 & 17"]
["Midscale Hotel",656,16.57,{"$f":"B3*C3","v":10869.92},54.04,{"$f":"E3*Lookups!$E$4/100*B3","v":364428.46720000001},2005,"hotel_casino_analysis.pdf, Table 16 & 18"]
["Upscale Hotel",842,14.96,{"$f":"B4*C4","v":12596.320000000002},40.57,{"$f":"E4*Lookups!$E$4/100*B4","v":351164.18319999997},2005,"hotel_casino_analysis.pdf, Table 16 & 19"]
["Luxury Hotel",905,18.18,{"$f":"B5*C5","v":16452.900000000001},49.01,{"$f":"E5*Lookups!$E$4/100*B5","v":455959.63399999996},2005,"hotel_casino_analysis.pdf, Table 16 & 20"]
["Apartment/Condo","Apartments in 5 or More Unit Buildings",null,11320,null,null,2009,"Residential Energy Consumption Survey (RECS) Table CE2.1  Household Site Fuel Consumption in the U.S., Totals and Averages, 2009 (Released January 2013)"]
{"$rows_left_out":15}
{"sheet":"Plywood tracking","index":19,"n_rows":13,"n_cols":11,"rows_kept":13,"cut":false,"hidden":true,"merged":[[10,7,10,9],[5,0,5,1],[4,2,4,3],[5,2,5,3],[0,0,0,10],[1,0,1,10],[8,7,8,9],[6,0,6,2],[3,2,3,3]]}
["Plywood Tracking Worksheet"]
[]
[]
["Production Name",null,null,null,null,null,null,null,"Currently there are only 3 factories in the world that provide 4'x10'x1/4\" lauan/meranti"]
["Construction Coordinator",null,null,null,null,null,null,null,"Factory","Location","Brand Name"]
["Production Location",null,null,null,null,null,null,null,"Cymao","Malaysia","Invowood"]
{"$rows_left_out":8}
{"sheet":"Equivalents","index":20,"n_rows":29,"n_cols":7,"rows_kept":29,"cut":false,"hidden":true,"merged":[]}
[null,"http://www.epa.gov/cleanenergy/energy-resources/calculator.html"]
[null,null,null,null,null,null,"Homes per Year"]
[null," 1 MT CO2 Emissions is equivalent to*:"]
[]
[null,"   Annual energy use from"]
[null,{"$f":"1/19.43","v":5.1466803911477101E-2},"homes for one year"]
{"$rows_left_out":23}